{"text_format":"3","workbook":"xlsx","n_sheets":3,"sheets":["HKPFSMA6","ReferenceData","Tables"],"not_rendered":{"defined_names":1},"read":"whole","date_system":"1900"}

{"sheet":"HKPFSMA6","index":0,"n_rows":255,"n_cols":30,"rows_kept":255,"merged":[[0,1,0,14],[0,15,0,28],[2,1,2,28],[3,1,3,28],[4,1,4,28],[6,1,6,28],[7,1,7,5],[7,7,7,11],[7,13,7,17],[7,19,7,23],[11,1,11,10],[11,11,11,27],[13,1,13,10],[13,14,13,27],[14,1,14,2],[15,1,15,10],[16,1,16,10],[16,11,16,27],[18,1,18,10],[18,11,18,27],[20,1,20,10],[20,11,20,27],[22,1,22,10],[22,11,22,27],[24,1,24,12],[24,14,24,27],[25,1,25,2],[26,1,26,10],[27,1,27,10],[27,11,27,17],[27,21,27,27],[28,1,28,5],[29,1,29,19],[30,1,31,27],[32,1,32,5],[33,1,33,27],[34,1,35,27],[36,2,36,5],[37,1,37,3],[37,4,37,28],[38,1,38,3],[38,4,38,28],[40,1,40,14],[44,1,44,2],[44,3,44,28],[46,1,46,28],[47,1,48,28],[50,1,50,14],[52,1,52,2],[52,3,52,28],[54,1,54,6],[54,7,54,21],[54,22,54,27],[55,1,55,6],[55,7,55,21],[55,22,55,27],[56,1,56,6],[56,7,56,21],[56,22,56,27],[57,1,57,6],[57,7,57,21],[57,22,57,27],[58,1,58,6],[58,7,58,21],[58,22,58,27],[59,1,59,6],[59,7,59,21],[59,22,59,27],[60,1,60,6],[60,7,60,21],[60,22,60,27],[61,1,61,6],[61,7,61,21],[61,22,61,27],[62,1,62,6],[62,7,62,21],[62,22,62,27],[63,1,63,6],[63,7,63,21],[63,22,63,27],[64,1,64,6],[64,7,64,21],[64,22,64,27],[65,1,65,6],[65,7,65,21],[65,22,65,27],[66,1,66,6],[66,7,66,21],[66,22,66,27],[67,1,67,6],[67,7,67,21],[67,22,67,27],[68,1,68,6],[68,7,68,21],[68,22,68,27],[69,1,69,6],[69,7,69,21],[69,22,69,27],[70,1,70,6],[70,7,70,21],[70,22,70,27],[71,1,71,6],[71,7,71,21],[71,22,71,27],[72,1,72,6],[72,7,72,21],[72,22,72,27],[73,1,73,6],[73,7,73,21],[73,22,73,27],[74,1,74,6],[74,7,74,21],[74,22,74,27],[75,1,75,3],[76,1,76,2],[76,3,76,28],[78,1,78,15],[78,16,78,21],[78,22,78,27],[79,1,79,15],[79,16,79,21],[79,22,79,27],[80,1,80,15],[80,16,80,21],[80,22,80,27],[81,1,81,15],[81,16,81,21],[81,22,81,27],[82,1,82,15],[82,16,82,21],[82,22,82,27],[83,1,83,15],[83,16,83,21],[83,22,83,27],[84,1,84,15],[84,16,84,21],[84,22,84,27],[85,1,85,15],[85,16,85,21],[85,22,85,27],[86,1,86,15],[86,16,86,21],[86,22,86,27],[87,1,87,15],[87,16,87,21],[87,22,87,27],[88,1,88,15],[88,16,88,21],[88,22,88,27],[89,1,89,15],[89,16,89,21],[89,22,89,27],[90,1,90,15],[90,16,90,21],[90,22,90,27],[91,1,91,15],[91,16,91,21],[91,22,91,27],[92,1,92,15],[92,16,92,21],[92,22,92,27],[93,1,93,15],[93,16,93,21],[93,22,93,27],[94,1,94,15],[94,16,94,21],[94,22,94,27],[95,1,95,15],[95,16,95,21],[95,22,95,27],[96,1,96,15],[96,16,96,21],[96,22,96,27],[98,1,98,14],[100,1,100,2],[100,3,100,28],[101,1,101,12],[102,1,102,14],[102,15,102,20],[102,22,102,25],[103,1,103,12],[104,1,104,7],[104,8,104,27],[105,1,105,7],[105,8,105,27],[106,1,106,7],[106,8,106,27],[107,1,107,7],[107,8,107,27],[108,1,108,7],[108,8,108,27],[109,1,109,7],[109,8,109,27],[111,1,111,12],[112,1,112,7],[112,8,112,27],[113,1,113,7],[113,8,113,27],[114,1,114,7],[114,8,114,27],[115,1,115,7],[115,8,115,27],[116,1,116,7],[116,8,116,27],[117,1,117,7],[117,8,117,27],[119,1,119,12],[120,1,120,7],[120,8,120,27],[121,1,121,7],[121,8,121,27],[122,1,122,7],[122,8,122,27],[123,1,123,7],[123,8,123,27],[124,1,124,7],[124,8,124,27],[125,1,125,7],[125,8,125,27],[127,1,127,12],[128,1,128,7],[128,8,128,27],[129,1,129,7],[129,8,129,27],[130,1,130,7],[130,8,130,27],[131,1,131,7],[131,8,131,27],[132,1,132,7],[132,8,132,27],[133,1,133,7],[133,8,133,27],[135,1,135,12],[136,1,136,7],[136,8,136,27],[137,1,137,7],[137,8,137,27],[138,1,138,7],[138,8,138,27],[139,1,139,7],[139,8,139,27],[140,1,140,7],[140,8,140,27],[141,1,141,7],[141,8,141,27],[144,1,144,3],[144,4,144,27],[145,1,145,14],[147,1,147,2],[147,3,147,28],[148,1,148,9],[149,1,149,7],[149,8,149,27],[150,1,150,7],[150,8,150,27],[151,1,151,7],[151,8,151,27],[152,8,152,18],[152,21,152,26],[153,1,153,7],[153,8,153,14],[153,15,153,26],[154,1,154,7],[154,8,154,27],[157,1,157,7],[157,8,157,27],[158,1,158,7],[158,8,158,27],[159,1,159,7],[159,8,159,27],[160,8,160,18],[160,21,160,26],[161,1,161,7],[161,8,161,14],[161,15,161,26],[162,1,162,7],[162,8,162,27],[165,1,165,7],[165,8,165,27],[166,1,166,7],[166,8,166,27],[167,1,167,7],[167,8,167,27],[168,8,168,18],[168,21,168,26],[169,1,169,7],[169,8,169,14],[169,15,169,26],[170,1,170,7],[170,8,170,27],[173,1,173,7],[173,8,173,27],[174,1,174,7],[174,8,174,27],[175,1,175,7],[175,8,175,27],[176,8,176,18],[176,21,176,26],[177,1,177,7],[177,8,177,14],[177,15,177,26],[178,1,178,7],[178,8,178,27],[181,1,181,7],[181,8,181,27],[182,1,182,7],[182,8,182,27],[183,1,183,7],[183,8,183,27],[184,8,184,18],[184,21,184,26],[185,1,185,7],[185,8,185,14],[185,15,185,26],[186,1,186,7],[186,8,186,27],[188,1,188,3],[188,4,188,28],[189,1,189,3],[189,4,189,27],[190,1,190,3],[190,4,190,27],[191,1,191,14],[193,1,193,2],[193,3,193,28],[195,1,195,28],[196,1,196,9],[197,1,197,2],[197,3,197,28],[199,1,199,28],[200,1,200,9],[201,1,201,28],[202,11,203,28],[203,5,203,10],[204,5,204,10],[204,11,204,28],[205,5,205,10],[205,11,205,28],[207,1,207,14],[209,1,209,28],[211,1,211,2],[211,3,211,28],[213,3,213,27],[214,3,215,27],[216,3,216,13],[217,1,217,6],[218,1,218,2],[220,1,220,28],[221,1,221,6],[222,1,222,3],[222,4,222,28],[223,1,223,6],[224,1,224,2],[224,3,224,19],[224,21,225,26],[227,1,227,3],[227,4,227,28],[228,1,228,6],[229,1,229,28],[231,5,231,10],[231,11,231,28],[232,5,232,10],[232,11,232,28],[233,1,233,10],[233,11,233,28],[234,1,234,6],[235,1,235,2],[237,1,237,28],[238,1,238,6],[239,1,239,3],[239,4,239,28],[241,1,241,14],[243,1,243,28],[245,1,245,28],[246,11,248,28],[248,1,248,10],[249,5,249,10],[249,11,249,28],[250,5,250,10],[250,11,250,28],[251,1,251,10],[251,11,251,28],[252,5,252,10],[252,11,252,28],[253,1,253,10],[253,11,253,28],[254,1,254,10],[254,11,254,28]]}
[null,"HKPFS(MA)6 (electronic form)"]
[]
[null,"RESEARCH GRANTS COUNCIL"]
[null,"Hong Kong PhD Fellowship Scheme"]
[null,"Graduate Report Form"]
[]
[null,"Sections A and B of this report should be completed and duly signed by the graduate who has received a fellowship under the Hong Kong PhD Fellowship Scheme.  Sections C and D should be completed and duly signed by the graduate’s supervisor, and staff of graduate school/research office at senior level respectively."]
[null,"[Jump to Section A]",{"$nulls":5},"[Jump to Section B]",{"$nulls":5},"[Jump to Section C]",{"$nulls":5},"[Jump to Section D]"]
[]
[null,"A: General Information (to be completed by the graduate)"]
[]
[null,"Name of graduate:"]
[]
[null,"HKPFS reference number:",{"$nulls":9},"PF",null,"-"]
[]
[null,"Student ID / University's  "]
[null,"reference number (if any):"]
[]
[null,"Department / Programme:"]
[]
[null,"Discipline:",{"$nulls":9},"<<please select>>",{"$nulls":17},".\n."]
[]
[null,"University:",{"$nulls":9},"<<please select>>"]
[]
[null,"PhD completion date: (dd-mm-yyyy)Note 1"]
[]
[null,"Fellowship period:"]
[null,"(dd-mm-yyyy to dd-mm-yyyy)",{"$nulls":17},"to"]
[]
[null,"Name and title of Supervisor(s) during the fellowship period: Note 2"]
[]
[]
[]
[null,"Name and title of Co-supervisor(s) during the fellowship period (if applicable):"]
[]
[]
[]
[null,"Note 1:\n\n\n\n",null,null,"The graduate report should be completed within one month upon graduation and submitted to the RGC in electronic format through respective universities.  HKPFS awardee who graduates in their third year of study may submit this report in lieu of the final annual report.",{"$nulls":24},".\n.\n."]
[null,"Note 2:",null,null,"Please provide name(s) and title(s) of more than one supervisor/co-supervisor, if applicable."]
[]
[null,"HKPFS(MA)6"]
[]
[null,"B: Summary of Study (to be completed by the graduate)"]
[]
[null,"(1)",null,"Summary of major achievements and experience in research in the years of PhD study:",{"$nulls":25},".\n."]
[]
[null,"Graduate is requested to use at least 300 words to write a summary statement on his/her study, which should  address the research achievements, experiences, learning points, etc. under the HKPFS.",{"$nulls":27},".\n."]
[]
[]
[]
[null,"HKPFS(MA)6"]
[]
[null,"(2a)",null,"Coursework undertaken and course grade(s) in the years of PhD study (if any):"]
[]
[null,"Course Code",{"$nulls":5},"Course Title",{"$nulls":14},"Grade"]
[{"$nulls":29},1]
[{"$nulls":29},2]
[{"$nulls":29},3]
[{"$nulls":29},4]
[{"$nulls":29},5]
[{"$nulls":29},6]
[{"$nulls":29},7]
[{"$nulls":29},8]
[{"$nulls":29},9]
[{"$nulls":29},10]
[{"$nulls":29},11]
[{"$nulls":29},12]
[{"$nulls":29},13]
[{"$nulls":29},14]
[{"$nulls":29},15]
[{"$nulls":29},16]
[{"$nulls":29},17]
[{"$nulls":29},18]
[{"$nulls":29},19]
[{"$nulls":29},20]
[]
[null,"(2b)",null,"Semester GPA and Cumulative GPA in the years of PhD study (if any): "]
[]
[null,"Year of study / Semester",{"$nulls":14},"Semester GPA",{"$nulls":5},"Cumulative GPA"]
[null,"1st year / Semester 1",{"$nulls":27},1]
{"$rows_left_out":176}
{"sheet":"ReferenceData","index":1,"n_rows":71,"n_cols":14,"rows_kept":71,"hidden":true}
[{"$nulls":3},"B-(3)",null,"B-(3)",null,"B-(4)",null,"C-(1)"]
["Discipline","University","U-Code","Status","S-Code","Role","R-Code","Role","R-Code","Selection","S-Code",null,"Discipline","D-Code"]
[null,"<<please select>>",0,"<<please select>>","<PS>","<<please select>>","<PS>","<<please select>>","<PS>","<<please select>>",0,null,"<<please select>>",0]
[null,"City University of Hong Kong","CityU","Published/Presented","1-Pub","Sole author","1-Sol","Speaker","1-Spk","to be factually correct and no amendment is required.","1-OK",null,"Architecture and Town Planning - Architecture",340]
[null,"Hong Kong Baptist University","HKBU","Accepted but not yet published/presented","2-Acc","First author, with other author(s)","2-1st","Participant","2-Par","that the following entries should be amended as follows:","2-Problem",null,"Architecture and Town Planning - Building and real estate",350]
[null,"Lingnan University","LU","Under review","3-Rev","Second author, with other author(s)","3-2nd","Others (Please specify :","3-Oth",{"$nulls":3},"Architecture and Town Planning - Town Planning",360]
[null,"The Chinese University of Hong Kong","CUHK","Submitted for publication/presentation","4-Sub","Contributory author","4-Con",{"$nulls":5},"Arts, Design and Performing Arts - Design",763]
[null,"The Education University of Hong Kong","EdUHK",{"$nulls":9},"Arts, Design and Performing Arts - Drawing, painting and sculpturing",761]
[null,"The Hong Kong Polytechnic University","PolyU",{"$nulls":9},"Arts, Design and Performing Arts - Music",762]
[null,"The Hong Kong University of Science and Technology","HKUST",{"$nulls":9},"Arts, Design and Performing Arts - Other creative arts",769]
[null,"The University of Hong Kong","HKUST",{"$nulls":9},"Biological Sciences - Biological sciences",210]
[{"$nulls":12},"Biological Sciences - Food sciences",220]
[{"$nulls":12},"Business and Management Studies - Accountancy",412]
[{"$nulls":12},"Business and Management Studies - Business administration with other specialisation (inc. business logistics / logistics management)",419]
[{"$nulls":12},"Business and Management Studies - Commercial studies",431]
[{"$nulls":12},"Business and Management Studies - Finance and investment",413]
[{"$nulls":12},"Business and Management Studies - General business administration",411]
[{"$nulls":12},"Business and Management Studies - Institutional administration",422]
[{"$nulls":12},"Business and Management Studies - Marketing",414]
[{"$nulls":12},"Computer Science and Information Technology",260]
[{"$nulls":12},"Dentistry - Clinical dentistry",121]
[{"$nulls":12},"Dentistry - Pre-clinical dentistry",122]
[{"$nulls":12},"Education - Education science",820]
[{"$nulls":12},"Education - Physical education",830]
[{"$nulls":12},"Engineering and Technology - Biotechnology",321]
[{"$nulls":12},"Engineering and Technology - Chemical engineering & materials techniques",311]
[{"$nulls":12},"Engineering and Technology - Civil engineering",312]
[{"$nulls":12},"Engineering and Technology - Electrical & electronic engineering(inc. computer engineering)",313]
[{"$nulls":12},"Engineering and Technology - Logistics (exc. business logistics / logistics management)",331]
[{"$nulls":12},"Engineering and Technology - Manufacturing & industrial engineering",314]
[{"$nulls":12},"Engineering and Technology - Mechanical engineering",315]
[{"$nulls":12},"Engineering and Technology - Other engineering",319]
[{"$nulls":12},"Engineering and Technology - Other technology",329]
[{"$nulls":12},"Engineering and Technology - Surveying",316]
[{"$nulls":12},"Engineering and Technology - Textile and clothing technology",322]
[{"$nulls":12},"Engineering and Technology - Transport and communications",330]
[{"$nulls":12},"Humanities - History",741]
[{"$nulls":12},"Humanities - Other humanities",749]
[{"$nulls":12},"Humanities - Philosophy",742]
[{"$nulls":12},"Humanities - Religion and theology",750]
[{"$nulls":12},"Languages and Related Studies - Chinese language and literature",611]
[{"$nulls":12},"Languages and Related Studies - Comparative literature",620]
[{"$nulls":12},"Languages and Related Studies - English language and literature",612]
[{"$nulls":12},"Languages and Related Studies - Linguistics",630]
[{"$nulls":12},"Languages and Related Studies - Other foreign language and their literature",619]
[{"$nulls":12},"Languages and Related Studies - Other language related studies",690]
[{"$nulls":12},"Law",530]
[{"$nulls":12},"Mass Communication and Documentation - Journalism, public relations and other mass communication arts",540]
[{"$nulls":12},"Mass Communication and Documentation - Library science",550]
[{"$nulls":12},"Mathematical Sciences - Mathematics, statistics and actuarial science",250]
[{"$nulls":12},"Medicine - Clinical medicine",111]
[{"$nulls":12},"Medicine - Pre-clinical medicine",112]
[{"$nulls":12},"Physical Sciences - Chemistry",231]
[{"$nulls":12},"Physical Sciences - Environmental studies",240]
[{"$nulls":12},"Physical Sciences - Other physical sciences",239]
[{"$nulls":12},"Physical Sciences - Physics",232]
[{"$nulls":12},"Social Sciences - Economics",511]
[{"$nulls":12},"Social Sciences - Geography",514]
[{"$nulls":12},"Social Sciences - Other social and behavioural sciences",519]
[{"$nulls":12},"Social Sciences - Psychology",513]
[{"$nulls":12},"Social Sciences - Public administration",521]
[{"$nulls":12},"Social Sciences - Social work and counselling",520]
[{"$nulls":12},"Social Sciences - Sociology",512]
[{"$nulls":12},"Social Sciences - Studies of regional cultures",515]
[{"$nulls":12},"Studies Allied to Medicine and Health - Chinese Medicine",136]
[{"$nulls":12},"Studies Allied to Medicine and Health - Dental technology",134]
[{"$nulls":12},"Studies Allied to Medicine and Health - Medical technology",133]
[{"$nulls":12},"Studies Allied to Medicine and Health - Nursing",131]
[{"$nulls":12},"Studies Allied to Medicine and Health - Other studies in medical diagnostics and treatment",139]
[{"$nulls":12},"Studies Allied to Medicine and Health - Pharmacy",135]
[{"$nulls":12},"Studies Allied to Medicine and Health - Rehabilitation medicine",132]

{"sheet":"Tables","index":2,"n_rows":28,"n_cols":31,"rows_kept":28,"hidden":true}
["Section A",{"$nulls":10},"Section B","Section B (3)",null,null,"Section B (5)",null,null,"Section C",{"$nulls":5},"Section D"]
["Main_Table",{"$nulls":10},"Main_Table",{"$nulls":6},"Main_Table",{"$nulls":5},"Main_Table"]
["Ref_No","Name","StudentID","Programme","Discipline","University","PhD_Comp_Date","Fellowship_Start_Date","Fellowship_End_Date","Supervisor","Cosupervisor","Summary","Number_Pub","Number_Count","Number_Check","Other_Outputs","Other_Comments","Signed_Date","Confirmation","Problem","Overall_Rating","Supervisor_Name","Supervisor_Title","Supervisor_Relationship","Staff_Name","Staff_Title","Staff_Department","Staff_University","Staff_Contact","Staff_Date"]
[{"$f":"HKPFSMA6!L14&HKPFSMA6!M14&HKPFSMA6!N14&HKPFSMA6!O14","v":"PF-"},{"$f":"HKPFSMA6!L12","v":0},{"$f":"HKPFSMA6!L17","v":0},{"$f":"HKPFSMA6!L19","v":0},{"$f":"VLOOKUP(HKPFSMA6!L21,ReferenceData!M:N,2,0)","v":0},{"$f":"VLOOKUP(HKPFSMA6!L23,ReferenceData!B2:C11,2,0)","v":0},{"$f":"HKPFSMA6!O25","v":0},{"$f":"HKPFSMA6!L28","v":0},{"$f":"HKPFSMA6!V28","v":0},{"$f":"HKPFSMA6!B31","v":0},{"$f":"HKPFSMA6!B35","v":0},{"$f":"HKPFSMA6!B48","v":0},{"$f":"HKPFSMA6!P103","v":0},{"$f":"COUNTIF(M:M,A4)","v":0},{"$f":"N4-M4","v":0},{"$f":"HKPFSMA6!B196","v":0},{"$f":"HKPFSMA6!B200","v":0},{"$f":"HKPFSMA6!L206","v":0},{"$f":"VLOOKUP(HKPFSMA6!D214,ReferenceData!J3:K5,2,0)","v":0},{"$f":"HKPFSMA6!D215","v":0},{"$f":"HKPFSMA6!V225","v":0},{"$f":"HKPFSMA6!L232","v":0},{"$f":"HKPFSMA6!L233","v":0},{"$f":"HKPFSMA6!L234","v":0},{"$f":"HKPFSMA6!M234","v":0},{"$f":"HKPFSMA6!N234","v":0},{"$f":"HKPFSMA6!O234","v":0},{"$f":"HKPFSMA6!P234","v":0},{"$f":"HKPFSMA6!Q234","v":0},{"$f":"HKPFSMA6!R234","v":0}]
[]
["Section B (2a)",{"$nulls":5},"Section B (2b)",{"$nulls":5},"Section B (3)",{"$nulls":8},"Section B (4)"]
["Course_Table",{"$nulls":5},"GPA_Table",{"$nulls":5},"Publication_Table",{"$nulls":8},"Activity_Table"]
["Ref_No","Sequence","C_Code","C_Title","Grade",null,"Ref_No","Sequence","Semester","SGPA","CGPA",null,"Ref_No","Sequence","P_Title","P_Venue","P_Status","P_Role","P_URL","P_Citation",null,"Ref_No","Sequence","A_Name","A_Organiser","A_Location","A_Amount","A_Role","A_Role_Others","A_Output"]
[{"$f":"IF(C9<>0,A$4,\"\")","v":""},{"$f":"IF(C9<>0,1,\"\")","v":""},{"$f":"HKPFSMA6!B56","v":0},{"$f":"HKPFSMA6!H56","v":0},{"$f":"HKPFSMA6!W56","v":0},null,{"$f":"IF(J9<>0,A$4,\"\")","v":""},{"$f":"IF(J9<>0,1,\"\")","v":""},{"$f":"IF(J9<>0,HKPFSMA6!B80,\"\")","v":""},{"$f":"HKPFSMA6!Q80","v":0},{"$f":"HKPFSMA6!W80","v":0},null,{"$f":"IF(O9<>0,A$4,\"\")","v":""},{"$f":"IF(O9<>0,1,\"\")","v":""},{"$f":"HKPFSMA6!I105","v":0},{"$f":"HKPFSMA6!I106","v":0},{"$f":"VLOOKUP(HKPFSMA6!I107,ReferenceData!D$2:E$7,2,0)","v":"<PS>"},{"$f":"VLOOKUP(HKPFSMA6!I108,ReferenceData!F2:G7,2,0)","v":"<PS>"},{"$f":"HKPFSMA6!I109","v":0},{"$f":"HKPFSMA6!I110","v":0},null,{"$f":"IF(X9<>0,A$4,\"\")","v":""},{"$f":"IF(X9<>0,1,\"\")","v":""},{"$f":"HKPFSMA6!I150","v":0},{"$f":"HKPFSMA6!I151","v":0},{"$f":"HKPFSMA6!I152","v":"<<please select>>"},{"$f":"IF(Z9=\"Overseas\",HKPFSMA6!V153,0)","v":0},{"$f":"VLOOKUP(HKPFSMA6!I154,ReferenceData!H:I,2,0)","v":"<PS>"},{"$f":"IF(AB9=\"3-Oth\",HKPFSMA6!P154,\"\")","v":""},{"$f":"HKPFSMA6!I155","v":0},1]
[{"$f":"IF(C10<>0,A$4,\"\")","v":""},{"$f":"IF(C10<>0,B9+1,\"\")","v":""},{"$f":"HKPFSMA6!B57","v":0},{"$f":"HKPFSMA6!H57","v":0},{"$f":"HKPFSMA6!W57","v":0},null,{"$f":"IF(J10<>0,A$4,\"\")","v":""},{"$f":"IF(J10<>0,H9+1,\"\")","v":""},{"$f":"IF(J10<>0,HKPFSMA6!B81,\"\")","v":""},{"$f":"HKPFSMA6!Q81","v":0},{"$f":"HKPFSMA6!W81","v":0},null,{"$f":"IF(O10<>0,A$4,\"\")","v":""},{"$f":"IF(O10<>0,N9+1,\"\")","v":""},{"$f":"HKPFSMA6!I113","v":0},{"$f":"HKPFSMA6!I114","v":0},{"$f":"VLOOKUP(HKPFSMA6!I115,ReferenceData!D$2:E$7,2,0)","v":"<PS>"},{"$f":"VLOOKUP(HKPFSMA6!I116,ReferenceData!F$2:G$7,2,0)","v":"<PS>"},{"$f":"HKPFSMA6!I117","v":0},{"$f":"HKPFSMA6!I118","v":0},null,{"$f":"IF(X10<>0,A$4,\"\")","v":""},{"$f":"IF(X10<>0,W9+1,\"\")","v":""},{"$f":"HKPFSMA6!I158","v":0},{"$f":"HKPFSMA6!I159","v":0},{"$f":"HKPFSMA6!I160","v":"<<please select>>"},{"$f":"IF(Z10=\"Overseas\",HKPFSMA6!V161,0)","v":0},{"$f":"VLOOKUP(HKPFSMA6!I162,ReferenceData!H:I,2,0)","v":"<PS>"},{"$f":"IF(AB10=\"3-Oth\",HKPFSMA6!P162,\"\")","v":""},{"$f":"HKPFSMA6!I163","v":0},2]
["",{"$f":"IF(C11<>0,B10+1,\"\")","v":""},{"$f":"HKPFSMA6!B58","v":0},{"$f":"HKPFSMA6!H58","v":0},{"$f":"HKPFSMA6!W58","v":0},null,"",{"$f":"IF(J11<>0,H10+1,\"\")","v":""},{"$f":"IF(J11<>0,HKPFSMA6!B82,\"\")","v":""},{"$f":"HKPFSMA6!Q82","v":0},{"$f":"HKPFSMA6!W82","v":0},null,{"$f":"IF(O11<>0,A$4,\"\")","v":""},{"$f":"IF(O11<>0,N10+1,\"\")","v":""},{"$f":"HKPFSMA6!I121","v":0},{"$f":"HKPFSMA6!I122","v":0},{"$f":"VLOOKUP(HKPFSMA6!I123,ReferenceData!D$2:E$7,2,0)","v":"<PS>"},{"$f":"VLOOKUP(HKPFSMA6!I124,ReferenceData!F$2:G$7,2,0)","v":"<PS>"},{"$f":"HKPFSMA6!I125","v":0},{"$f":"HKPFSMA6!I126","v":0},null,"",{"$f":"IF(X11<>0,W10+1,\"\")","v":""},{"$f":"HKPFSMA6!I166","v":0},{"$f":"HKPFSMA6!I167","v":0},{"$f":"HKPFSMA6!I168","v":"<<please select>>"},{"$f":"IF(Z11=\"Overseas\",HKPFSMA6!V169,0)","v":0},{"$f":"VLOOKUP(HKPFSMA6!I170,ReferenceData!H:I,2,0)","v":"<PS>"},{"$f":"IF(AB11=\"3-Oth\",HKPFSMA6!P170,\"\")","v":""},{"$f":"HKPFSMA6!I171","v":0},3]
["",{"$f":"IF(C12<>0,B11+1,\"\")","v":""},{"$f":"HKPFSMA6!B59","v":0},{"$f":"HKPFSMA6!H59","v":0},{"$f":"HKPFSMA6!W59","v":0},null,"","",{"$f":"IF(J12<>0,HKPFSMA6!B83,\"\")","v":""},{"$f":"HKPFSMA6!Q83","v":0},{"$f":"HKPFSMA6!W83","v":0},null,{"$f":"IF(O12<>0,A$4,\"\")","v":""},"",{"$f":"HKPFSMA6!I129","v":0},{"$f":"HKPFSMA6!I130","v":0},{"$f":"VLOOKUP(HKPFSMA6!I131,ReferenceData!D$2:E$7,2,0)","v":"<PS>"},{"$f":"VLOOKUP(HKPFSMA6!I132,ReferenceData!F$2:G$7,2,0)","v":"<PS>"},{"$f":"HKPFSMA6!I133","v":0},{"$f":"HKPFSMA6!I134","v":0},null,"","",{"$f":"HKPFSMA6!I174","v":0},{"$f":"HKPFSMA6!I175","v":0},{"$f":"HKPFSMA6!I176","v":"<<please select>>"},{"$f":"IF(Z12=\"Overseas\",HKPFSMA6!V177,0)","v":0},{"$f":"VLOOKUP(HKPFSMA6!I178,ReferenceData!H:I,2,0)","v":"<PS>"},{"$f":"IF(AB12=\"3-Oth\",HKPFSMA6!P178,\"\")","v":""},{"$f":"HKPFSMA6!I179","v":0},4]
["","",{"$f":"HKPFSMA6!B60","v":0},{"$f":"HKPFSMA6!H60","v":0},{"$f":"HKPFSMA6!W60","v":0},null,"","",{"$f":"IF(J13<>0,HKPFSMA6!B84,\"\")","v":""},{"$f":"HKPFSMA6!Q84","v":0},{"$f":"HKPFSMA6!W84","v":0},null,{"$f":"IF(O13<>0,A$4,\"\")","v":""},"",{"$f":"HKPFSMA6!I137","v":0},{"$f":"HKPFSMA6!I138","v":0},{"$f":"VLOOKUP(HKPFSMA6!I139,ReferenceData!D$2:E$7,2,0)","v":"<PS>"},{"$f":"VLOOKUP(HKPFSMA6!I140,ReferenceData!F$2:G$7,2,0)","v":"<PS>"},{"$f":"HKPFSMA6!I141","v":0},{"$f":"HKPFSMA6!I142","v":0},"<  Auto  >","","",{"$f":"HKPFSMA6!I182","v":0},{"$f":"HKPFSMA6!J183","v":0},{"$f":"HKPFSMA6!I184","v":"<<please select>>"},{"$f":"IF(Z13=\"Overseas\",HKPFSMA6!V185,0)","v":0},{"$f":"VLOOKUP(HKPFSMA6!I186,ReferenceData!H:I,2,0)","v":"<PS>"},{"$f":"IF(AB13=\"3-Oth\",HKPFSMA6!P186,\"\")","v":""},{"$f":"HKPFSMA6!I187","v":0},5]
["","",{"$f":"HKPFSMA6!B61","v":0},{"$f":"HKPFSMA6!H61","v":0},{"$f":"HKPFSMA6!W61","v":0},null,"","",{"$f":"IF(J14<>0,HKPFSMA6!B85,\"\")","v":""},{"$f":"HKPFSMA6!Q85","v":0},{"$f":"HKPFSMA6!W85","v":0},{"$nulls":9},"Max 5 Rows",{"$nulls":9},6]
["","",{"$f":"HKPFSMA6!B62","v":0},{"$f":"HKPFSMA6!H62","v":0},{"$f":"HKPFSMA6!W62","v":0},null,"","",{"$f":"IF(J15<>0,HKPFSMA6!B86,\"\")","v":""},{"$f":"HKPFSMA6!Q86","v":0},{"$f":"HKPFSMA6!W86","v":0},{"$nulls":19},7]
["","",{"$f":"HKPFSMA6!B63","v":0},{"$f":"HKPFSMA6!H63","v":0},{"$f":"HKPFSMA6!W63","v":0},null,"","",{"$f":"IF(J16<>0,HKPFSMA6!B87,\"\")","v":""},{"$f":"HKPFSMA6!Q87","v":0},{"$f":"HKPFSMA6!W87","v":0},{"$nulls":19},8]
["","",{"$f":"HKPFSMA6!B64","v":0},{"$f":"HKPFSMA6!H64","v":0},{"$f":"HKPFSMA6!W64","v":0},null,"","",{"$f":"IF(J17<>0,HKPFSMA6!B88,\"\")","v":""},{"$f":"HKPFSMA6!Q88","v":0},{"$f":"HKPFSMA6!W88","v":0},{"$nulls":19},9]
["","",{"$f":"HKPFSMA6!B65","v":0},{"$f":"HKPFSMA6!H65","v":0},{"$f":"HKPFSMA6!W65","v":0},null,"","",{"$f":"IF(J18<>0,HKPFSMA6!B89,\"\")","v":""},{"$f":"HKPFSMA6!Q89","v":0},{"$f":"HKPFSMA6!W89","v":0},{"$nulls":19},10]
["","",{"$f":"HKPFSMA6!B66","v":0},{"$f":"HKPFSMA6!H66","v":0},{"$f":"HKPFSMA6!W66","v":0},null,"","",{"$f":"IF(J19<>0,HKPFSMA6!B90,\"\")","v":""},{"$f":"HKPFSMA6!Q90","v":0},{"$f":"HKPFSMA6!W90","v":0},{"$nulls":19},11]
["","",{"$f":"HKPFSMA6!B67","v":0},{"$f":"HKPFSMA6!H67","v":0},{"$f":"HKPFSMA6!W67","v":0},null,"","",{"$f":"IF(J20<>0,HKPFSMA6!B91,\"\")","v":""},{"$f":"HKPFSMA6!Q91","v":0},{"$f":"HKPFSMA6!W91","v":0},{"$nulls":19},12]
["","",{"$f":"HKPFSMA6!B68","v":0},{"$f":"HKPFSMA6!H68","v":0},{"$f":"HKPFSMA6!W68","v":0},null,"","",{"$f":"HKPFSMA6!B92","v":0},{"$f":"HKPFSMA6!Q92","v":0},{"$f":"HKPFSMA6!W92","v":0},{"$nulls":19},13]
["","",{"$f":"HKPFSMA6!B69","v":0},{"$f":"HKPFSMA6!H69","v":0},{"$f":"HKPFSMA6!W69","v":0},null,"","",{"$f":"HKPFSMA6!B93","v":0},{"$f":"HKPFSMA6!Q93","v":0},{"$f":"HKPFSMA6!W93","v":0},{"$nulls":19},14]
["","",{"$f":"HKPFSMA6!B70","v":0},{"$f":"HKPFSMA6!H70","v":0},{"$f":"HKPFSMA6!W70","v":0},null,"","",{"$f":"HKPFSMA6!B94","v":0},{"$f":"HKPFSMA6!Q94","v":0},{"$f":"HKPFSMA6!W94","v":0},{"$nulls":19},15]
["","",{"$f":"HKPFSMA6!B71","v":0},{"$f":"HKPFSMA6!H71","v":0},{"$f":"HKPFSMA6!W71","v":0},null,"","",{"$f":"HKPFSMA6!B95","v":0},{"$f":"HKPFSMA6!Q95","v":0},{"$f":"HKPFSMA6!W95","v":0},{"$nulls":19},16]
["","",{"$f":"HKPFSMA6!B72","v":0},{"$f":"HKPFSMA6!H72","v":0},{"$f":"HKPFSMA6!W72","v":0},null,"","",{"$f":"HKPFSMA6!B96","v":0},{"$f":"HKPFSMA6!Q96","v":0},{"$f":"HKPFSMA6!W96","v":0},{"$nulls":19},17]
["","",{"$f":"HKPFSMA6!B73","v":0},{"$f":"HKPFSMA6!H73","v":0},{"$f":"HKPFSMA6!W73","v":0},null,"","",{"$f":"HKPFSMA6!B97","v":0},{"$f":"HKPFSMA6!Q97","v":0},{"$f":"HKPFSMA6!W97","v":0},"< Auto Max 18 Rows",{"$nulls":18},18]
["","",{"$f":"HKPFSMA6!B74","v":0},{"$f":"HKPFSMA6!H74","v":0},{"$f":"HKPFSMA6!W74","v":0},{"$nulls":25},19]
["","",{"$f":"HKPFSMA6!B75","v":0},{"$f":"HKPFSMA6!H75","v":0},{"$f":"HKPFSMA6!W75","v":0},"< Auto Max 20 Rows",{"$nulls":24},20]